{"text_format":"1","workbook":"xlsx","n_sheets":7,"sheets":["Introduction","Input screen","Coding","Production Rate Estimates","Historical Production Rates","Regression Coefficients","Background"],"not_rendered":{"charts":0,"images":2,"macros":1,"external_links":0,"defined_names":7,"comments":0,"pivot_tables":0},"unopened":[],"bounds":{"document_bytes":16777216,"sheet_cells":100000,"rows_first":2000,"rows_last":500,"rows_between":2000,"halvings":0,"cell_chars":16384,"cell_head_chars":4096},"cells_cut":0,"cells_raw":0,"read":"whole","date_system":"1900"}

{"sheet":"Introduction","index":0,"n_rows":14,"n_cols":2,"rows_kept":14,"cut":false,"hidden":false,"merged":[]}
[]
[]
[]
[]
[]
[null,"Welcome to the MDT Production Rate Estimation Tool (PRET)"]
[]
[null,"This user-friendly tool is designed to help MDT to quantitatively estimate production rates of major controlling activities of highway projects using the historical project data."]
[]
[null,"PRET consists of three major sections. A user needs to provide specific project parameters in the first section such as district, location type, season of work, budget type, and project type. Also, the user needs to provide the engineer's estimate of the project under consideration and quantities of work items.                        "]
{"$rows_left_out":5}
{"sheet":"Input screen","index":1,"n_rows":18,"n_cols":3,"rows_kept":18,"cut":false,"hidden":false,"merged":[]}
[]
[]
[]
[]
[]
[null,"Select District","District 2 - Butte"]
[null,"The maintenance district where the project is geographically located."]
[]
[null,"Select Location Type","Urban"]
[null,"Rural or Urban area is selected according to the location of the project."]
{"$rows_left_out":9}
{"sheet":"Coding","index":2,"n_rows":42,"n_cols":6,"rows_kept":42,"cut":false,"hidden":false,"merged":[]}
[null,"CODING"]
["Select District"]
[null,"Option",null,"Selection",{"$f":"'Input screen'!C6","v":"District 2 - Butte"}]
[1,"District 1 - Missoula",null,null,"Index","Value"]
[2,"District 2 - Butte",null,null,null,{"$f":"MATCH(E3,District)","v":2}]
[3,"District 3 - Great Falls"]
[4,"District 4 - Glendive"]
[5,"District 5 - Billings"]
["Select Location"]
[null,"Option",null,"Selection",{"$f":"'Input screen'!C9","v":"Urban"}]
{"$rows_left_out":33}
{"sheet":"Production Rate Estimates","index":3,"n_rows":35,"n_cols":11,"rows_kept":35,"cut":false,"hidden":false,"merged":[[0,0,0,8],[2,0,3,0],[2,1,3,1],[2,3,3,3],[2,2,3,2],[2,4,3,4],[2,5,2,8]]}
["PRODUCTION RATE ESTIMATES"]
[]
["SN","Activity Description","Unit","Quantity","Production Rates\n(Per day)","Statistical measures from historical data",null,null,null,null,"Note:"]
[null,null,null,null,null,"Mean","Q1","Median","Q3",null,"a. Provide quantities for controlling activities in column D."]
["AA","TOPSOIL-SALVAGING AND PLACING","CUYD",null,{"$f":"Background!AD3","v":""},2313.4211178270148,306.19050000000004,1267.2308333333335,3071.3959176648113,null,"b. Predicted production rates are shown in column E."]
["AB","EXCAVATION-UNCLASSIFIED","CUYD",null,{"$f":"Background!AD4","v":""},8874.3465926090685,940.69666666666672,4950,12541.838941715952,null,"c. Mean: average production rate of historical projects."]
["AC","SPECIAL BORROW","CUYD",null,{"$f":"Background!AD5","v":""},3640.2539261089901,644.79889537940312,1807.8022083206727,3709.7912499999998,null,"d. Q1: 25% of historical projects have production rates lower than Q1."]
["AD","EXCAVATION-STREET","CUYD",null,{"$f":"Background!AD6","v":""},1518.1244878192754,518.40249999999992,977.84719999999993,2426.3667857142855,null,"e. Median: 50% of historical projects have production rates lower than Median."]
["AE","CRUSHED AGGREGATE COURSE","CUYD",null,{"$f":"Background!AD7","v":""},2087.9926693411835,132.09375,636.17631791654685,2653.5211683168145,null,"f. Q3: 75% of historical projects have production rates lower than Q3."]
["AF","BASE-CEMENT TREATED","CUYD",null,{"$f":"Background!AD8","v":""},3453.3634909105554,1549.766594998425,3565.8003759058615,5045.1139999999996]
{"$rows_left_out":26}
{"sheet":"Historical Production Rates","index":4,"n_rows":41,"n_cols":49,"rows_kept":41,"cut":false,"hidden":false,"merged":[[0,0,1,3],[2,29,2,33],[2,34,2,38],[2,39,2,43],[2,44,2,48],[2,0,3,0],[2,1,3,1],[2,2,3,2],[2,3,3,3],[2,4,2,8],[2,9,2,13],[2,14,2,18],[2,19,2,23],[2,24,2,28]]}
["HISTORICAL PRODUCTION RATES"]
[]
["SN","Activity Description","Unit","Mean","Rural",null,null,null,null,"Urban ",null,null,null,null,"Budget less than $2 Million",null,null,null,null,"Budget greater than $2 Million",null,null,null,null,"District 1",null,null,null,null,"District 2",null,null,null,null,"District 3",null,null,null,null,"District 4",null,null,null,null,"District 5"]
[null,null,null,"Mean","Mean","Q1","Median","Q3","N","Mean","Q1","Median","Q3","N","Mean","Q1","Median","Q3","N","Mean","Q1","Median","Q3","N","Mean","Q1","Median","Q3","N","Mean","Q1","Median","Q3","N","Mean","Q1","Median","Q3","N","Mean","Q1","Median","Q3","N","Mean","Q1","Median","Q3","N"]
["AA","TOPSOIL-SALVAGING AND PLACING","CUYD",2313.4211178270148,2504.8341,392.46499999999997,1388.5150000000001,3323.8625000000002,180,1174.0869,153.13,531.95000000000005,2058.81,13,1015.4754,122.9375,352.20499999999998,1248.28,80,3383.0679,1140.1600000000001,2619.54,4629.5600000000004,115,1902.1488999999999,272.5625,1566.5,2784.53,36,2114.1415000000002,261.60000000000002,847.23,2708.92,39,3384.0484000000001,394.99250000000001,1144.9649999999999,3015.94,38,2818.7037999999998,150.63499999999999,1487.23,4650.3999999999996,37,2886.2752,800.35249999999996,1783.605,3200.8,44]
["AB","EXCAVATION-UNCLASSIFIED","CUYD",8874.3465926090685,9274.0571,1219,5506,13169.75,140,9468.4,107,318,14370,15,3186.1176,321.75,1127,4884.25,68,13972.124,4507.5,10455,21758.5,89,7298,518.75,3236,9060.75,46,7974.4827999999998,902.5,4185,12556,29,9818.7083000000002,820.25,6003,13560.5,24,13725.825999999999,2206,11171,21875,23,9632.1764999999996,2112.75,6123,13609.75,34]
["AC","SPECIAL BORROW","CUYD",3640.2539261089901,3919.7386000000001,744.9425,1938.915,3644.6774999999998,110,1645.7063000000001,269.01249999999999,694.36500000000001,1842.2574999999999,16,1159.9042999999999,236.26,583.41,1629.19,37,4656.3185000000003,1063.4825000000001,2428.23,4479.0249999999996,92,3494.1914000000002,356.685,1096,4489.3999999999996,29,5107.6896999999999,686.875,2069.19,5003.3950000000004,29,2767.1613000000002,423.59,1665.77,2275.6,15,3108.7611000000002,1197.51,1971.77,3612.12,19,3340.9513999999999,653.23500000000001,1796.355,3961.3225000000002,36]
["AD","EXCAVATION-STREET","CUYD",1518.1244878192754,2003.51,714.42499999999995,1522.71,2620.5475000000001,12,1173.9169999999999,191.00749999999999,908.65,2426.37,10,993.81399999999996,191.00749999999999,508.95,2157.8249999999998,10,2153.5958000000001,898.37249999999995,1755.67,2620.5475000000001,12,1812.925,1054.3375000000001,1856.1949999999999,2528.2424999999998,4,1423.7325000000001,358.26499999999999,1362.4949999999999,2550.4375,4,1496.5571,204.45,971.19,2647.9,7,1478.825,661.2,1478.825,2296.4499999999998,2,1880.222,194.88,874.1,4068.625,5]
["AE","CRUSHED AGGREGATE COURSE","CUYD",2087.9926693411835,2467.4924999999998,161.13499999999999,794.30499999999995,3158.82,242,686.37888999999996,75.362499999999997,452.01,867.21,36,604.59810000000004,60.895000000000003,184.19,557.495,137,3732.8838000000001,771.81500000000005,2475.0100000000002,5502.17,146,1393.0162,95.03,527.99,2017.34,71,2577.7671,292.74,876.24,3846.58,51,1974.2677000000001,139.82,566.87,2575.9699999999998,53,2486.4193,313.19499999999999,1003.55,3139.4,45,2909.3465000000001,94.224999999999994,846.68,3277.9050000000002,62]
["AF","BASE-CEMENT TREATED","CUYD",3453.3634909105554,3453.3638000000001,1358.2650000000001,3565.8,5281.39,13,null,null,null,null,null,null,null,null,null,null,3453.3638000000001,1358.2650000000001,3565.8,5281.39,13,null,null,null,null,null,8009.76,8009.76,8009.76,8009.76,1,6114.81,6114.81,6114.81,6114.81,1,2737.5088999999998,1084.9100000000001,2069.5500000000002,4585,9,3065.79,2565.7800000000002,3065.79,3565.8,2]
{"$rows_left_out":32}
{"sheet":"Regression Coefficients","index":5,"n_rows":33,"n_cols":46,"rows_kept":33,"cut":false,"hidden":false,"merged":[[0,5,0,28],[0,29,0,33],[0,34,0,35],[0,36,0,37],[0,38,0,39]]}
[null,null,"INTERCEPT","QUANTITY","PRJCT_TTL_AMT","NEW_WORK_TYPE",null,null,null,null,null,null,null,null,null,null,null,null,null,null,null,null,null,null,null,null,null,null,null,"DISTRICT",null,null,null,null,"BUDGET",null,"AREA",null,"WINTER",null,"NBR_PECS","NBR_USED","USED_HRS","NBR_SUPRVSR","OTH_WRKR","WRKD_HRS"]
["No","Production Rate Items",null,null,null,110,111,120,141,150,160,170,183,185,210,230,232,310,311,312,313,410,411,412,510,520,620,650,710,1,2,3,4,5,0,1,0,1,0,1]
[1,"TOPSOIL-SALVAGING AND PLACING",-283.12139999999999,0.14178160000000001,null,1166.1206999999999,735.67628000000002,2995.4866000000002,1199.9124999999999,1620.0767000000001,1541.4827,1890,4569.0321999999996,1890,1068.3311000000001,1654.4627,714.13550999999995,1550.4478999999999,null,null,1138.6668999999999,1890,1890,null,4064.5464000000002,1890,2462.1941999999999,3759.7467000000001,0,-1462.1369999999999,-425.83179999999999,-749.56759999999997,-1353.816,0,null,null,null,null,null,null,null,null,null,null,null,5.4399312999999996]
[2,"EXCAVATION-UNCLASSIFIED",4570.2855,2.7372199999999999E-2,null,null,null,null,null,null,null,null,null,null,null,null,null,null,null,null,null,null,null,null,null,null,null,null,null,null,null,null,null,null,-3452.4659999999999,0,null,null,null,null,144.73847000000001]
[3,"SPECIAL BORROW",1176.9074000000001,7.2899400000000003E-2,null,null,null,null,null,null,null,null,null,null,null,null,null,null,null,null,null,null,null,null,null,null,null,null,null,null,null,null,null,null,null,null,null,null,null,null,146.71709999999999,-150.38159999999999,null,-619.30560000000003]
[4,"EXCAVATION-STREET",365.42327999999998,0.1101502]
[5,"CRUSHED AGGREGATE COURSE",70.920270000000002,0.11614910000000001,null,null,null,null,null,null,null,null,null,null,null,null,null,null,null,null,null,null,null,null,null,null,null,null,null,null,null,null,null,null,null,null,null,null,null,null,35.898125]
[6,"BASE-CEMENT TREATED"]
[7,"DRAINAGE PIPE (<= 24 IN)",58.598998999999999,1.19933E-2,3.5277999999999999E-6,19.958264,67.070327000000006,29.877801000000002,49.863309000000001,25.765767,-3.0734720000000002,-54.716569999999997,29.573675999999999,29,31.675951999999999,-19.588249999999999,200.03344999999999,2.6000595999999998,null,null,86.461200000000005,-1.4657979999999999,29,null,29,29,4.1061991999999998,null,0,null,null,null,null,null,null,null,null,null,null,null,null,-0.90187899999999999]
[8,"DRAINAGE PIPE (> 24 IN)",74.673580000000001,2.2025599999999999E-2,-1.7719999999999999E-6,null,null,null,null,null,null,null,null,null,null,null,null,null,null,null,null,null,null,null,null,null,null,null,null,null,null,null,null,null,null,null,null,null,null,null,null,null,null,6.6378779999999997]
{"$rows_left_out":24}
{"sheet":"Background","index":6,"n_rows":33,"n_cols":33,"rows_kept":33,"cut":false,"hidden":false,"merged":[[0,3,1,3],[0,4,1,4],[0,30,0,31]]}
["SN","PRODUCTION RATE ITEMS","QUANTITY","PRJCT_TTL_AMT","NEW_WORK_TYPE","DISTRICT","BUDGET","AREA","WINTER","NBR_PECS","NBR_USED","USED_HRS","NBR_SUPRVSR","OTH_WRKR","WRKD_HRS","SUM_1","SUM_2","SUM_3","SUM_4","SUM_5","SUM","Mean","Q1","Median","Q3","Min ","Max","RAW 1","RAW 2","FINAL","Historical quantities",null,"Examples"]
[null,null,null,null,null,null,null,null,null,null,null,null,null,null,null,null,null,null,null,null,null,null,null,null,null,null,null,"PRODUCTIVITY","PRODUCTIVITY","PRODUCTIVITY","Min","Max","Quantity"]
["AA",{"$f":"'Regression Coefficients'!B3","v":"TOPSOIL-SALVAGING AND PLACING"},{"$f":"'Production Rate Estimates'!D5","v":0},{"$f":"Coding!B42","v":3000000},{"$f":"Coding!F24","v":110},{"$f":"Coding!F5","v":2},{"$f":"Coding!F20","v":1},{"$f":"Coding!F12","v":1},{"$f":"Coding!F16","v":1},18.311557788944725,12.190954773869347,35.085427135678394,1.1132075471698113,6.9245283018867925,31.778301886792452,{"$f":"'Regression Coefficients'!C3+'Regression Coefficients'!D3*Background!C3+'Regression Coefficients'!E3*Background!D3","v":-283.12139999999999},{"$f":"HLOOKUP(E3,'Regression Coefficients'!$F$2:$AC$33,1+MATCH(B3,'Regression Coefficients'!$B$3:$B$33,0),FALSE)","v":1166.1206999999999},{"$f":"IF(F3=1,'Regression Coefficients'!AD3,IF(F3=2,'Regression Coefficients'!AE3,IF(F3=3,'Regression Coefficients'!AF3,IF(F3=4,'Regression Coefficients'!AG3,'Regression Coefficients'!AH3))))","v":-425.83179999999999},{"$f":"IF(G3=0,'Regression Coefficients'!AI3,'Regression Coefficients'!AJ3)+IF(H3=0,'Regression Coefficients'!AK3,'Regression Coefficients'!AL3)+IF(I3=0,'Regression Coefficients'!AM3,'Regression Coefficients'!AN3)","v":0},{"$f":"SUMPRODUCT('Regression Coefficients'!AO3:AT3,Background!J3:O3)","v":172.8717790948113},{"$f":"P3+Q3+R3+S3+T3","v":630.03927909481126},2313.4211178270148,306.19050000000004,1267.2308333333335,3071.3959176648113,26.5,19255.073519273985,{"$f":"IF(U3<Z3,Z3,U3)","v":630.03927909481126},{"$f":"IF(AB3>AA3,AA3,AB3)","v":630.03927909481126},{"$f":"IF(C3<=0,\"\",AC3)","v":""},8,115530,65290.279014935826]
["AB",{"$f":"'Regression Coefficients'!B4","v":"EXCAVATION-UNCLASSIFIED"},{"$f":"'Production Rate Estimates'!D6","v":0},{"$f":"$D$3","v":3000000},{"$f":"$E$3","v":110},{"$f":"$F$3","v":2},{"$f":"$G$3","v":1},{"$f":"$H$3","v":1},{"$f":"$I$3","v":1},19.451807228915662,13.674698795180722,36.69879518072289,1.0795454545454546,7.8409090909090908,37.113636363636367,{"$f":"'Regression Coefficients'!C4+'Regression Coefficients'!D4*Background!C4+'Regression Coefficients'!E4*Background!D4","v":4570.2855},{"$f":"HLOOKUP(E4,'Regression Coefficients'!$F$2:$AC$33,1+MATCH(B4,'Regression Coefficients'!$B$3:$B$33,0),FALSE)","v":0},{"$f":"IF(F4=1,'Regression Coefficients'!AD4,IF(F4=2,'Regression Coefficients'!AE4,IF(F4=3,'Regression Coefficients'!AF4,IF(F4=4,'Regression Coefficients'!AG4,'Regression Coefficients'!AH4))))","v":0},{"$f":"IF(G4=0,'Regression Coefficients'!AI4,'Regression Coefficients'!AJ4)+IF(H4=0,'Regression Coefficients'!AK4,'Regression Coefficients'!AL4)+IF(I4=0,'Regression Coefficients'!AM4,'Regression Coefficients'!AN4)","v":0},{"$f":"SUMPRODUCT('Regression Coefficients'!AO4:AT4,Background!J4:O4)","v":2815.4248170481928},{"$f":"P4+Q4+R4+S4+T4","v":7385.7103170481932},8874.3465926090685,940.69666666666672,4950,12541.838941715952,17.14,43698,{"$f":"IF(U4<Z4,Z4,U4)","v":7385.7103170481932},{"$f":"IF(AB4>AA4,AA4,AB4)","v":7385.7103170481932},{"$f":"IF(C4<=0,\"\",AC4)","v":""},17,1193215,101898.46966040775]
["AC",{"$f":"'Regression Coefficients'!B5","v":"SPECIAL BORROW"},{"$f":"'Production Rate Estimates'!D7","v":0},{"$f":"$D$3","v":3000000},{"$f":"$E$3","v":110},{"$f":"$F$3","v":2},{"$f":"$G$3","v":1},{"$f":"$H$3","v":1},{"$f":"$I$3","v":1},24.35483870967742,16.846774193548388,43.822580645161288,1.2971014492753623,10.659420289855072,46.369565217391305,{"$f":"'Regression Coefficients'!C5+'Regression Coefficients'!D5*Background!C5+'Regression Coefficients'!E5*Background!D5","v":1176.9074000000001},{"$f":"HLOOKUP(E5,'Regression Coefficients'!$F$2:$AC$33,1+MATCH(B5,'Regression Coefficients'!$B$3:$B$33,0),FALSE)","v":0},{"$f":"IF(F5=1,'Regression Coefficients'!AD5,IF(F5=2,'Regression Coefficients'!AE5,IF(F5=3,'Regression Coefficients'!AF5,IF(F5=4,'Regression Coefficients'!AG5,'Regression Coefficients'!AH5))))","v":0},{"$f":"IF(G5=0,'Regression Coefficients'!AI5,'Regression Coefficients'!AJ5)+IF(H5=0,'Regression Coefficients'!AK5,'Regression Coefficients'!AL5)+IF(I5=0,'Regression Coefficients'!AM5,'Regression Coefficients'!AN5)","v":0},{"$f":"SUMPRODUCT('Regression Coefficients'!AO5:AT5,Background!J5:O5)","v":236.52425708274882},1413.4316570827489,3640.2539261089901,644.79889537940312,1807.8022083206727,3709.7912499999998,9.24,36198.129233696825,{"$f":"IF(U5<Z5,Z5,U5)","v":1413.4316570827489},1413.4316570827489,"",28,325783,34495.013306882844]
["AD",{"$f":"'Regression Coefficients'!B6","v":"EXCAVATION-STREET"},{"$f":"'Production Rate Estimates'!D8","v":0},3000000,110,2,1,1,1,16.920000000000002,11.8,35.92,1.52,8.32,33.4,{"$f":"'Regression Coefficients'!C6+'Regression Coefficients'!D6*Background!C6+'Regression Coefficients'!E6*Background!D6","v":365.42327999999998},{"$f":"HLOOKUP(E6,'Regression Coefficients'!$F$2:$AC$33,1+MATCH(B6,'Regression Coefficients'!$B$3:$B$33,0),FALSE)","v":0},{"$f":"IF(F6=1,'Regression Coefficients'!AD6,IF(F6=2,'Regression Coefficients'!AE6,IF(F6=3,'Regression Coefficients'!AF6,IF(F6=4,'Regression Coefficients'!AG6,'Regression Coefficients'!AH6))))","v":0},{"$f":"IF(G6=0,'Regression Coefficients'!AI6,'Regression Coefficients'!AJ6)+IF(H6=0,'Regression Coefficients'!AK6,'Regression Coefficients'!AL6)+IF(I6=0,'Regression Coefficients'!AM6,'Regression Coefficients'!AN6)","v":0},{"$f":"SUMPRODUCT('Regression Coefficients'!AO6:AT6,Background!J6:O6)","v":0},365.42327999999998,1518.1244878192754,518.40249999999992,977.84719999999993,2426.3667857142855,52.25,5734.5917748282154,{"$f":"IF(U6<Z6,Z6,U6)","v":365.42327999999998},365.42327999999998,"",75,27191,22846.431250281246]
["AE",{"$f":"'Regression Coefficients'!B7","v":"CRUSHED AGGREGATE COURSE"},{"$f":"'Production Rate Estimates'!D9","v":0},3000000,110,2,1,1,1,17.036630036630036,12.208791208791208,34.575091575091577,0.95253164556962022,6.9050632911392409,33.357594936708864,{"$f":"'Regression Coefficients'!C7+'Regression Coefficients'!D7*Background!C7+'Regression Coefficients'!E7*Background!D7","v":70.920270000000002},{"$f":"HLOOKUP(E7,'Regression Coefficients'!$F$2:$AC$33,1+MATCH(B7,'Regression Coefficients'!$B$3:$B$33,0),FALSE)","v":0},{"$f":"IF(F7=1,'Regression Coefficients'!AD7,IF(F7=2,'Regression Coefficients'!AE7,IF(F7=3,'Regression Coefficients'!AF7,IF(F7=4,'Regression Coefficients'!AG7,'Regression Coefficients'!AH7))))","v":0},{"$f":"IF(G7=0,'Regression Coefficients'!AI7,'Regression Coefficients'!AJ7)+IF(H7=0,'Regression Coefficients'!AK7,'Regression Coefficients'!AL7)+IF(I7=0,'Regression Coefficients'!AM7,'Regression Coefficients'!AN7)","v":0},{"$f":"SUMPRODUCT('Regression Coefficients'!AO7:AT7,Background!J7:O7)","v":611.58307463369965},682.50334463369961,2087.9926693411835,132.09375,636.17631791654685,2653.5211683168145,1.85,20606.504777009781,{"$f":"IF(U7<Z7,Z7,U7)","v":682.50334463369961},682.50334463369961,"",1,151590,28186.335846225153]
["AF",{"$f":"'Regression Coefficients'!B8","v":"BASE-CEMENT TREATED"},{"$f":"'Production Rate Estimates'!D10","v":0},3000000,110,2,1,1,1,27.384615384615383,17.46153846153846,20.615384615384617,1.6,12.733333333333333,27.666666666666668,null,null,null,null,null,null,3453.3634909105554,1549.766594998425,3565.8003759058615,5045.1139999999996,577.48,8009.7633333333333,null,{"$f":"V8","v":3453.3634909105554},"",2887,58891,2887]
["AG",{"$f":"'Regression Coefficients'!B9","v":"DRAINAGE PIPE (<= 24 IN)"},{"$f":"'Production Rate Estimates'!D11","v":0},3000000,110,2,1,1,1,18.834170854271356,13.361809045226131,40.959798994974875,1.300469483568075,8.8920187793427239,43.483568075117368,{"$f":"'Regression Coefficients'!C9+'Regression Coefficients'!D9*Background!C9+'Regression Coefficients'!E9*Background!D9","v":69.182399000000004},{"$f":"HLOOKUP(E9,'Regression Coefficients'!$F$2:$AC$33,1+MATCH(B9,'Regression Coefficients'!$B$3:$B$33,0),FALSE)","v":19.958264},{"$f":"IF(F9=1,'Regression Coefficients'!AD9,IF(F9=2,'Regression Coefficients'!AE9,IF(F9=3,'Regression Coefficients'!AF9,IF(F9=4,'Regression Coefficients'!AG9,'Regression Coefficients'!AH9))))","v":0},{"$f":"IF(G9=0,'Regression Coefficients'!AI9,'Regression Coefficients'!AJ9)+IF(H9=0,'Regression Coefficients'!AK9,'Regression Coefficients'!AL9)+IF(I9=0,'Regression Coefficients'!AM9,'Regression Coefficients'!AN9)","v":0},{"$f":"SUMPRODUCT('Regression Coefficients'!AO9:AT9,Background!J9:O9)","v":-12.050734979899499},77.089928020100501,95.233632207673409,59.042307692307688,86.77421419883494,112.22858506323075,1.5,527.31299212598435,{"$f":"IF(U9<Z9,Z9,U9)","v":77.089928020100501},{"$f":"IF(AB9>AA9,AA9,AB9)","v":77.089928020100501},{"$f":"IF(C9<=0,\"\",AC9)","v":""},3,9692,2458]
["AH",{"$f":"'Regression Coefficients'!B10","v":"DRAINAGE PIPE (> 24 IN)"},{"$f":"'Production Rate Estimates'!D12","v":0},3000000,110,2,1,1,1,22.155172413793103,15.629310344827585,50.318965517241381,1.4628099173553719,11,52.231404958677686,{"$f":"'Regression Coefficients'!C10+'Regression Coefficients'!D10*Background!C10+'Regression Coefficients'!E10*Background!D10","v":69.357579999999999},{"$f":"HLOOKUP(E10,'Regression Coefficients'!$F$2:$AC$33,1+MATCH(B10,'Regression Coefficients'!$B$3:$B$33,0),FALSE)","v":0},{"$f":"IF(F10=1,'Regression Coefficients'!AD10,IF(F10=2,'Regression Coefficients'!AE10,IF(F10=3,'Regression Coefficients'!AF10,IF(F10=4,'Regression Coefficients'!AG10,'Regression Coefficients'!AH10))))","v":0},{"$f":"IF(G10=0,'Regression Coefficients'!AI10,'Regression Coefficients'!AJ10)+IF(H10=0,'Regression Coefficients'!AK10,'Regression Coefficients'!AL10)+IF(I10=0,'Regression Coefficients'!AM10,'Regression Coefficients'!AN10)","v":0},{"$f":"SUMPRODUCT('Regression Coefficients'!AO10:AT10,Background!J10:O10)","v":9.7099537685950406},79.067533768595041,91.077115947174264,54.826279527559066,72.800000000000011,118.5,4.666666666666667,336.90500000000003,{"$f":"IF(U10<Z10,Z10,U10)","v":79.067533768595041},79.067533768595041,{"$f":"IF(C10<=0,\"\",AC10)","v":""},14,4942,1433]
{"$rows_left_out":23}